GCC-2.95.3 (Chap6) error messages

Hans-Michael Kirr hongs at web.de
Thu Nov 29 03:45:43 PST 2001

Hello Everybody,

I followed the hint of keeping chapter 5 and chapter 6 separate. Therefor I tried to install
GCC-2.95.3 in chapter 6 right after glibc-2.2.4 (and creating devices) and got the following
error messages:
Bootstrap comparison failure!
alias.o differs
bitmap.o differs
c-aux-info.o differs
flow.o differs
fold-const.o differs
function.o differs
g++spec.o differs
cp/typeck.o differs
cp/typeck2.o differs
cp/xref.o differs
make[1]: *** [compare] Error 1
make[1]: Leaving directory `/usr/src/gcc-build/gcc'
make: *** [bootstrap] Error 2

I continued with installation of Man-pages-1.39 (without errors) and Findutils-4.1 with errors again:
/bin/sh: /usr/bin/ginstall: No such file or directory
/bin/sh: /usr/bin/ginstall: No such file or directory
make[1]: *** [install-info] Error 127
make[1]: Leaving directory `/usr/src/findutils-4.1/doc'
making install in testsuite
make[1]: Entering directory `/usr/src/findutils-4.1/testsuite'
make[1]: Nothing to be done for `install'.
make[1]: Leaving directory `/usr/src/findutils-4.1/testsuite'

Can anybody help? Shouldn't I follow this hint as a LFS Newbie?
I use LFS Version 3.0-rc2 and SuSE 7.0 as host system.


Hans-Michael Kirr

Die schönsten Ski-Regionen der Alpen - jetzt bei Ferienklick.de

Unsubscribe: send email to listar at linuxfromscratch.org
and put 'unsubscribe lfs-support' in the subject header of the message

More information about the lfs-support mailing list