glibc test errors

Chris Buxton cbuxton at menandmice.com
Wed Jun 18 20:54:47 PDT 2008


I'm using version SVN-20080603, and the initial build host is Ubuntu Server 8.04. Using package users system.

When building glibc on page 6.10, the test suite produces the following:

# grep -n 'Error 1' ../test.log 
1203:make[2]: *** [/usr/src/glibc/glibc-build/dlfcn/default.out] Error 1
2025:make[2]: [/usr/src/glibc/glibc-build/posix/annexc.out] Error 1 (ignored)
2268:make[2]: *** [/usr/src/glibc/glibc-build/crypt/sha512c-test.out] Error 1
2450:make[2]: *** [/usr/src/glibc/glibc-build/nptl/tst-cond20.out] Error 1
2455:make[2]: *** [/usr/src/glibc/glibc-build/nptl/tst-cond21.out] Error 1
2987:make[2]: *** [/usr/src/glibc/glibc-build/nptl/tst-cancelx4.out] Error 1
2995:make[2]: *** [/usr/src/glibc/glibc-build/nptl/tst-cancelx5.out] Error 1
3012:make[2]: *** [/usr/src/glibc/glibc-build/nptl/tst-cancelx10.out] Error 1
3038:make[2]: *** [/usr/src/glibc/glibc-build/nptl/tst-cancelx18.out] Error 1
3941:make[2]: *** [/usr/src/glibc/glibc-build/elf/order.out] Error 1

I know I can ignore the posix/annexc.out, per the build instructions, but what about the rest of these? Are these normal?

Chris Buxton
Professional Services
Men & Mice



More information about the hlfs-dev mailing list