stupid newbie question

Jaap Struyk japie at deserver.nl
Sat Jul 30 08:19:50 PDT 2005


ivtv:
make CONFIG_VIDEO_IVTV=m -C /lib/modules/2.6.11.12-grsec/build
M=/usr/src/ivtv-0.2.0-rc3k/driver modules
make[1]: Entering directory `/usr/src/linux-2.6.11.12'
  CC [M]  /usr/src/ivtv-0.2.0-rc3k/driver/msp3400.o
  CC [M]  /usr/src/ivtv-0.2.0-rc3k/driver/saa7115.o
  CC [M]  /usr/src/ivtv-0.2.0-rc3k/driver/cx25840-driver.o
include/linux/crypto.h: In function `load_aud_fw':
include/linux/crypto.h:274: warning: asm operand 1 probably doesn't
match constraints
include/linux/crypto.h:274: warning: asm operand 1 probably doesn't
match constraints
include/linux/crypto.h:282: warning: asm operand 1 probably doesn't
match constraints
include/linux/crypto.h:282: warning: asm operand 1 probably doesn't
match constraints
include/linux/crypto.h:288: warning: asm operand 1 probably doesn't
match constraints
include/linux/crypto.h:265: warning: asm operand 1 probably doesn't
match constraints
include/linux/crypto.h:288: warning: asm operand 1 probably doesn't
match constraints
include/linux/crypto.h:265: warning: asm operand 1 probably doesn't
match constraints
include/linux/crypto.h:274: error: impossible constraint in `asm'
include/linux/crypto.h:274: error: impossible constraint in `asm'
include/linux/crypto.h:282: error: impossible constraint in `asm'
include/linux/crypto.h:282: error: impossible constraint in `asm'
include/linux/crypto.h:288: error: impossible constraint in `asm'
include/linux/crypto.h:265: error: impossible constraint in `asm'
include/linux/crypto.h:288: error: impossible constraint in `asm'
include/linux/crypto.h:265: error: impossible constraint in `asm'
make[2]: *** [/usr/src/ivtv-0.2.0-rc3k/driver/cx25840-driver.o] Error 1
make[1]: *** [_module_/usr/src/ivtv-0.2.0-rc3k/driver] Error 2
make[1]: Leaving directory `/usr/src/linux-2.6.11.12'
make: *** [all] Error 2

nvidia:
   include/asm/io.h: In function `check_signature':
   include/asm/io.h:242: warning: wrong type argument to increment
  
/tmp/selfgz613/NVIDIA-Linux-x86-1.0-7667-pkg1/usr/src/nv/os-interface.c:
In 
   function `os_canary_check':
  
/tmp/selfgz613/NVIDIA-Linux-x86-1.0-7667-pkg1/usr/src/nv/os-interface.c:1227
   : warning: asm operand 1 probably doesn't match constraints
  
/tmp/selfgz613/NVIDIA-Linux-x86-1.0-7667-pkg1/usr/src/nv/os-interface.c:1227
   : error: impossible constraint in `asm'
   make[4]: ***
[/tmp/selfgz613/NVIDIA-Linux-x86-1.0-7667-pkg1/usr/src/nv/os-in
   terface.o] Error 1
   make[3]: ***
[_module_/tmp/selfgz613/NVIDIA-Linux-x86-1.0-7667-pkg1/usr/src/
   nv] Error 2
   make[2]: *** [modules] Error 2
   NVIDIA: left KBUILD.
   nvidia.ko failed to build!
   make[1]: *** [module] Error 1
   make: *** [module] Error 2

What the 2 have in common is:
asm operand 1 probably doesn't match constraints
and
impossible constraint in `asm'
Both modules build fine on a clean kernel, but the errors don't make
sence to me.
-- 
Groetjes Japie




More information about the hlfs-dev mailing list