arts-xxx error on hlfs-SVN-20050709

randhir phagura rsphagura at hotmail.com
Sat Jul 23 04:16:02 PDT 2005


Hi,

I am trying to install 'hlfs-bhlfs' & 'blfs-packages- svn-20050712' on my 
Compaq-presario-p3. I have finished installing hlfs and bhlfs. 'x-org' is 
working fine. I have also finished installing the various dependencies of 
'arts', 'kdelibs'  and 'kdebase'. I had planned to install 'kde-3.4.1' 
packages. So i started with 'arts-1.4.1'. This gave similar error to what is 
displayed below. I then tried installation with 'arts-1.4.0' and 
'arts-1.3.2'. in both cases the error was in 'arts-xxx/flow'. The error is 
given below:

../../flow/gsl/gslcommon.h:244: warning: type qualifiers ignored on function
return type
gsltests.c: In function `main':
gsltests.c:73: warning: assignment from incompatible pointer type
gsltests.c:513: warning: declaration of 'a' shadows a previous local
gsltests.c:69: warning: shadowed declaration is here
gsltests.c:535: warning: declaration of 'order' shadows a previous local
gsltests.c:70: warning: shadowed declaration is here
gsltests.c:539: warning: declaration of 'a' shadows a previous local
gsltests.c:69: warning: shadowed declaration is here
gsltests.c:539: warning: declaration of 'b' shadows a previous local
gsltests.c:69: warning: shadowed declaration is here
/bin/sh ../../libtool --silent --mode=link --tag=CC gcc -ansi -Wall
-Wchar-subscripts -Wpointer-arith -Wmissing-prototypes -Wwrite-strings
-D_XOPEN_SOURCE=500 -D_BSD_SOURCE -DNDEBUG -O2 -Wformat-security
-Wmissing-format-attribute -pthread -I/usr/include/glib-2.0
-I/usr/lib/glib-2.0/include -ansi -W -Wall -Wchar-subscripts -Wshadow
-Wpointer-arith -Wmissing-prototypes -Wwrite-strings -D_XOPEN_SOURCE=500
-D_BSD_SOURCE -DNDEBUG -O2   -Wformat-security -Wmissing-format-attribute 
-pthread
-I/usr/include/glib-2.0 -I/usr/lib/glib-2.0/include     -o gsltests  
gsltests.o
libgsl.la -lm
gcc -DHAVE_CONFIG_H -I. -I. -I../.. -I../../flow -I../../flow -I../../mcop 
-I../..
-I/opt/kde/include -I/opt/qt/include -I/usr/X11R6/include  -I../../libltdl
-DQT_THREAD_SUPPORT  -D_REENTRANT -pthread -I/usr/include/glib-2.0
-I/usr/lib/glib-2.0/include   -ansi -Wall -Wchar-subscripts -Wpointer-arith
-Wmissing-prototypes -Wwrite-strings -D_XOPEN_SOURCE=500 -D_BSD_SOURCE 
-DNDEBUG
-O2 -Wformat-security -Wmissing-format-attribute -pthread 
-I/usr/include/glib-2.0
-I/usr/lib/glib-2.0/include -ansi -W -Wall -Wchar-subscripts -Wshadow
-Wpointer-arith -Wmissing-prototypes -Wwrite-strings -D_XOPEN_SOURCE=500
-D_BSD_SOURCE -DNDEBUG -O2   -Wformat-security -Wmissing-format-attribute 
-pthread
-I/usr/include/glib-2.0 -I/usr/lib/glib-2.0/include   -c gslffttest.c
In file included from gslffttest.c:18:
../../flow/gsl/gslcommon.h:244: warning: type qualifiers ignored on function
return type
gslffttest.c:55: warning: unused parameter 'argc'
gslffttest.c:56: warning: unused parameter 'argv'
/bin/sh ../../libtool --silent --mode=link --tag=CC gcc -ansi -Wall
-Wchar-subscripts -Wpointer-arith -Wmissing-prototypes -Wwrite-strings
-D_XOPEN_SOURCE=500 -D_BSD_SOURCE -DNDEBUG -O2 -Wformat-security
-Wmissing-format-attribute -pthread -I/usr/include/glib-2.0
-I/usr/lib/glib-2.0/include -ansi -W -Wall -Wchar-subscripts -Wshadow
-Wpointer-arith -Wmissing-prototypes -Wwrite-strings -D_XOPEN_SOURCE=500
-D_BSD_SOURCE -DNDEBUG -O2   -Wformat-security -Wmissing-format-attribute 
-pthread
-I/usr/include/glib-2.0 -I/usr/lib/glib-2.0/include     -o gslffttest
gslffttest.o libgsl.la -lm
make[3]: Leaving directory `/p/arts-1.3.2/flow/gsl'
Making all in gslpp
make[3]: Entering directory `/p/arts-1.3.2/flow/gslpp'
/bin/sh ../../libtool --silent --mode=compile --tag=CXX g++ -DHAVE_CONFIG_H 
-I.
-I. -I../.. -I../../flow -I../../flow/gsl -I../../flow -I../../mcop -I../..
-I/opt/kde/include -I/opt/qt/include -I/usr/X11R6/include  -I../../libltdl
-DQT_THREAD_SUPPORT  -D_REENTRANT -pthread -I/usr/include/glib-2.0
-I/usr/lib/glib-2.0/include    -Wnon-virtual-dtor -Wno-long-long -Wundef 
-ansi
-D_XOPEN_SOURCE=500 -D_BSD_SOURCE -Wcast-align -Wconversion 
-Wchar-subscripts
-Wall -W -Wpointer-arith -Wwrite-strings -DNDEBUG -DNO_DEBUG -O2 
-Wformat-security
-Wmissing-format-attribute -fno-exceptions -fno-check-new -fno-common
-ftemplate-depth-99  -c -o datahandle.lo datahandle.cpp
/bin/sh ../../libtool --silent --mode=link --tag=CXX g++  -Wnon-virtual-dtor
-Wno-long-long -Wundef -ansi -D_XOPEN_SOURCE=500 -D_BSD_SOURCE -Wcast-align
-Wconversion -Wchar-subscripts -Wall -W -Wpointer-arith -Wwrite-strings 
-DNDEBUG
-DNO_DEBUG -O2 -Wformat-security -Wmissing-format-attribute -fno-exceptions
-fno-check-new -fno-common  -ftemplate-depth-99    -o libgslpp.la   
datahandle.lo
make[3]: Leaving directory `/p/arts-1.3.2/flow/gslpp'
make[3]: Entering directory `/p/arts-1.3.2/flow'
../mcopidl/mcopidl -t ../flow/artsflow.idl
make[3]: *** [artsflow.cc] Segmentation fault
make[3]: Leaving directory `/p/arts-1.3.2/flow'
make[2]: *** [all-recursive] Error 1
make[2]: Leaving directory `/p/arts-1.3.2/flow'
make[1]: *** [all-recursive] Error 1
make[1]: Leaving directory `/p/arts-1.3.2'
make: *** [all] Error 2
root at vlnxsvr:/p/arts-1.3.2#

Kindly help.
regards

RSP

_________________________________________________________________
Meet interesting singles like you 
http://match.msn.co.in/match/mt.cfm?pg=channel&tcid=234764 Sign up with 
Match.com




More information about the hlfs-dev mailing list