Binutils-2.15.94.0.2 test

Nabil SEFRIOUI admin at osmium-work.com
Sat Feb 26 21:48:09 PST 2005


i have finished the build, and until now all is fine

i have derived from the book in 5 points :
- upgrade to findutils-4.2.18 (all test passed)
- upgrade to gettext-0.14.2 (all test passed)
- upgrade to iana-etc-1.04 (uhh...)
- upgrade to udev-053 (no visible problem)
- added kernel-2.6-layer7-1.0.patch (compiled ok but not yet tested)

thanks for your help Robert :)


Le Dimanche 27 Février 2005 05:16, Robert Connolly a écrit :
> I'm getting errors now too. I'll haven't figured out what it is yet.
> I'll let you know. Thanks for pointing it out.
>
> On February 25, 2005 07:04 pm, Robert Connolly wrote:
> > I don't think you followed the instructions exactly, though I might
> > be wrong. I haven't built with glibc in a while, last time I did
> > all the testsuites passed perfectly. I can start a glibc build to
> > check but I won't be done until tommorrow.
> >
> > robert
> >
> > On February 25, 2005 06:38 pm, Nabil SEFRIOUI wrote:
> > > i'm using glibc + findutils-4.2.18 + gettext-0.14.2
> > >
> > > Le Vendredi 25 Février 2005 23:34, Robert Connolly a écrit :
> > > > For uClibc, yes. It's not because of any hlfs stuff, its
> > > > because of uClibc.
> > > >
> > > > On February 25, 2005 06:03 pm, Nabil SEFRIOUI wrote:
> > > > > it is normal to have these failures under vanilla specs ? :
> > > > > the step is chapter 6.13.
> > > > >
> > > > >                === ld tests ===
> > > > >
> > > > > Schedule of variations:
> > > > >     unix
> > > > >
> > > > > Running target unix
> > > > > Using /tools/share/dejagnu/baseboards/unix.exp as board
> > > > > description file for target.
> > > > > Using /tools/share/dejagnu/config/unix.exp as generic
> > > > > interface file for target.
> > > > > Using
> > > > > /src/binutils-2.15.94.0.2/ld/testsuite/config/default.exp as
> > > > > tool-and-target-specific interface file.
> > > > > Running
> > > > > /src/binutils-2.15.94.0.2/ld/testsuite/ld-alpha/alpha.exp ...
> > > > > Running
> > > > > /src/binutils-2.15.94.0.2/ld/testsuite/ld-arm/arm-elf.exp ...
> > > > > Running
> > > > > /src/binutils-2.15.94.0.2/ld/testsuite/ld-auto-import/auto-im
> > > > >port.e xp ... Running
> > > > > /src/binutils-2.15.94.0.2/ld/testsuite/ld-bootstrap/bootstrap
> > > > >.exp ... Running
> > > > > /src/binutils-2.15.94.0.2/ld/testsuite/ld-cdtest/cdtest.exp
> > > > > ... Running
> > > > > /src/binutils-2.15.94.0.2/ld/testsuite/ld-checks/checks.exp
> > > > > ... Running
> > > > > /src/binutils-2.15.94.0.2/ld/testsuite/ld-cris/cris.exp ...
> > > > > Running /src/binutils-2.15.94.0.2/ld/testsuite/ld-crx/crx.exp
> > > > > ...
> > > > > Running
> > > > > /src/binutils-2.15.94.0.2/ld/testsuite/ld-cygwin/exe-export.e
> > > > >xp ... Running
> > > > > /src/binutils-2.15.94.0.2/ld/testsuite/ld-d10v/d10v.exp ...
> > > > > Running
> > > > > /src/binutils-2.15.94.0.2/ld/testsuite/ld-discard/discard.exp
> > > > > ... Running
> > > > > /src/binutils-2.15.94.0.2/ld/testsuite/ld-elf/elf.exp ...
> > > > > Running
> > > > > /src/binutils-2.15.94.0.2/ld/testsuite/ld-elf/exclude.exp ...
> > > > > Running
> > > > > /src/binutils-2.15.94.0.2/ld/testsuite/ld-elf/frame.exp ...
> > > > > Running
> > > > > /src/binutils-2.15.94.0.2/ld/testsuite/ld-elf/sec64k.exp ...
> > > > > Running
> > > > > /src/binutils-2.15.94.0.2/ld/testsuite/ld-elfcomm/elfcomm.exp
> > > > > ... Running
> > > > > /src/binutils-2.15.94.0.2/ld/testsuite/ld-elfvers/vers.exp
> > > > > ... FAIL: vers24c
> > > > > Running
> > > > > /src/binutils-2.15.94.0.2/ld/testsuite/ld-elfvsb/elfvsb.exp
> > > > > ... FAIL: visibility (hidden_normal) (non PIC)
> > > > > FAIL: visibility (hidden_normal) (non PIC, load offset)
> > > > > FAIL: visibility (hidden_normal)
> > > > > FAIL: visibility (hidden_normal) (PIC main, non PIC so)
> > > > > FAIL: visibility (hidden_normal) (PIC main)
> > > > > FAIL: visibility (hidden_weak) (non PIC)
> > > > > FAIL: visibility (hidden_weak) (non PIC, load offset)
> > > > > FAIL: visibility (hidden_weak)
> > > > > FAIL: visibility (hidden_weak) (PIC main, non PIC so)
> > > > > FAIL: visibility (hidden_weak) (PIC main)
> > > > > FAIL: visibility (protected) (non PIC)
> > > > > FAIL: visibility (protected) (non PIC, load offset)
> > > > > FAIL: visibility (protected)
> > > > > FAIL: visibility (protected) (PIC main, non PIC so)
> > > > > FAIL: visibility (protected) (PIC main)
> > > > > FAIL: visibility (protected_undef_def) (non PIC)
> > > > > FAIL: visibility (protected_undef_def) (non PIC, load offset)
> > > > > FAIL: visibility (protected_undef_def)
> > > > > FAIL: visibility (protected_undef_def) (PIC main, non PIC so)
> > > > > FAIL: visibility (protected_undef_def) (PIC main)
> > > > > FAIL: visibility (protected_weak) (non PIC)
> > > > > FAIL: visibility (protected_weak) (non PIC, load offset)
> > > > > FAIL: visibility (protected_weak)
> > > > > FAIL: visibility (protected_weak) (PIC main, non PIC so)
> > > > > FAIL: visibility (protected_weak) (PIC main)
> > > > > FAIL: visibility (normal) (non PIC)
> > > > > FAIL: visibility (normal) (non PIC, load offset)
> > > > > FAIL: visibility (normal)
> > > > > FAIL: visibility (normal) (PIC main, non PIC so)
> > > > > FAIL: visibility (normal) (PIC main)
> > > > > Running
> > > > > /src/binutils-2.15.94.0.2/ld/testsuite/ld-elfweak/elfweak.exp
> > > > > ... FAIL: ELF weak data first DSO
> > > > > FAIL: ELF weak data last DSO
> > > > > Running
> > > > > /src/binutils-2.15.94.0.2/ld/testsuite/ld-fastcall/fastcall.e
> > > > >xp ... Running
> > > > > /src/binutils-2.15.94.0.2/ld/testsuite/ld-frv/fdpic.exp ...
> > > > > Running
> > > > > /src/binutils-2.15.94.0.2/ld/testsuite/ld-frv/frv-elf.exp ...
> > > > > Running
> > > > > /src/binutils-2.15.94.0.2/ld/testsuite/ld-h8300/h8300.exp ...
> > > > > Running
> > > > > /src/binutils-2.15.94.0.2/ld/testsuite/ld-i386/i386.exp ...
> > > > > Running
> > > > > /src/binutils-2.15.94.0.2/ld/testsuite/ld-ia64/ia64.exp ...
> > > > > Running
> > > > > /src/binutils-2.15.94.0.2/ld/testsuite/ld-linkonce/linkonce.e
> > > > >xp ... Running
> > > > > /src/binutils-2.15.94.0.2/ld/testsuite/ld-m68hc11/m68hc11.exp
> > > > > ... Running
> > > > > /src/binutils-2.15.94.0.2/ld/testsuite/ld-maxq/maxq.exp ...
> > > > > Running
> > > > > /src/binutils-2.15.94.0.2/ld/testsuite/ld-mips-elf/mips-elf-f
> > > > >lags.e xp ... Running
> > > > > /src/binutils-2.15.94.0.2/ld/testsuite/ld-mips-elf/mips-elf.e
> > > > >xp ... Running
> > > > > /src/binutils-2.15.94.0.2/ld/testsuite/ld-mmix/mmix.exp ...
> > > > > Running /src/binutils-2.15.94.0.2/ld/testsuite/ld-pe/pe.exp
> > > > > ... Running
> > > > > /src/binutils-2.15.94.0.2/ld/testsuite/ld-powerpc/powerpc.exp
> > > > > ... Running
> > > > > /src/binutils-2.15.94.0.2/ld/testsuite/ld-s390/s390.exp ...
> > > > > Running
> > > > > /src/binutils-2.15.94.0.2/ld/testsuite/ld-scripts/align.exp
> > > > > ... Running
> > > > > /src/binutils-2.15.94.0.2/ld/testsuite/ld-scripts/assert.exp
> > > > > ... Running
> > > > > /src/binutils-2.15.94.0.2/ld/testsuite/ld-scripts/crossref.ex
> > > > >p ... Running
> > > > > /src/binutils-2.15.94.0.2/ld/testsuite/ld-scripts/data.exp
> > > > > ... Running
> > > > > /src/binutils-2.15.94.0.2/ld/testsuite/ld-scripts/defined.exp
> > > > > ... Running
> > > > > /src/binutils-2.15.94.0.2/ld/testsuite/ld-scripts/dynamic-sec
> > > > >tions. exp ... Running
> > > > > /src/binutils-2.15.94.0.2/ld/testsuite/ld-scripts/map-address
> > > > >.exp ... Running
> > > > > /src/binutils-2.15.94.0.2/ld/testsuite/ld-scripts/overlay-siz
> > > > >e.exp ... Running
> > > > > /src/binutils-2.15.94.0.2/ld/testsuite/ld-scripts/phdrs.exp
> > > > > ... Running
> > > > > /src/binutils-2.15.94.0.2/ld/testsuite/ld-scripts/phdrs2.exp
> > > > > ... Running
> > > > > /src/binutils-2.15.94.0.2/ld/testsuite/ld-scripts/provide.exp
> > > > > ... Running
> > > > > /src/binutils-2.15.94.0.2/ld/testsuite/ld-scripts/script.exp
> > > > > ... Running
> > > > > /src/binutils-2.15.94.0.2/ld/testsuite/ld-scripts/size.exp
> > > > > ... Running
> > > > > /src/binutils-2.15.94.0.2/ld/testsuite/ld-scripts/sizeof.exp
> > > > > ... Running
> > > > > /src/binutils-2.15.94.0.2/ld/testsuite/ld-scripts/sort.exp
> > > > > ... Running
> > > > > /src/binutils-2.15.94.0.2/ld/testsuite/ld-scripts/weak.exp
> > > > > ... Running
> > > > > /src/binutils-2.15.94.0.2/ld/testsuite/ld-selective/sel-dump.
> > > > >exp ... Running
> > > > > /src/binutils-2.15.94.0.2/ld/testsuite/ld-selective/selective
> > > > >.exp ... Running
> > > > > /src/binutils-2.15.94.0.2/ld/testsuite/ld-sh/arch/arch.exp
> > > > > ... Running
> > > > > /src/binutils-2.15.94.0.2/ld/testsuite/ld-sh/rd-sh.exp ...
> > > > > Running /src/binutils-2.15.94.0.2/ld/testsuite/ld-sh/sh.exp
> > > > > ... Running
> > > > > /src/binutils-2.15.94.0.2/ld/testsuite/ld-sh/sh64/rd-sh64.exp
> > > > > ... Running
> > > > > /src/binutils-2.15.94.0.2/ld/testsuite/ld-sh/sh64/relax.exp
> > > > > ... Running
> > > > > /src/binutils-2.15.94.0.2/ld/testsuite/ld-sh/sh64/relfail.exp
> > > > > ... Running
> > > > > /src/binutils-2.15.94.0.2/ld/testsuite/ld-sh/sh64/sh64.exp
> > > > > ... Running
> > > > > /src/binutils-2.15.94.0.2/ld/testsuite/ld-shared/shared.exp
> > > > > ... FAIL: shared (non PIC)
> > > > > FAIL: shared (non PIC, load offset)
> > > > > FAIL: shared
> > > > > FAIL: shared (PIC main, non PIC so)
> > > > > FAIL: shared (PIC main)
> > > > > Running
> > > > > /src/binutils-2.15.94.0.2/ld/testsuite/ld-sparc/sparc.exp ...
> > > > > Running
> > > > > /src/binutils-2.15.94.0.2/ld/testsuite/ld-srec/srec.exp ...
> > > > > FAIL: S-records
> > > > > FAIL: S-records with constructors
> > > > > Running
> > > > > /src/binutils-2.15.94.0.2/ld/testsuite/ld-undefined/undefined
> > > > >.exp ... Running
> > > > > /src/binutils-2.15.94.0.2/ld/testsuite/ld-undefined/weak-unde
> > > > >f.exp ... Running
> > > > > /src/binutils-2.15.94.0.2/ld/testsuite/ld-v850/v850.exp ...
> > > > > Running
> > > > > /src/binutils-2.15.94.0.2/ld/testsuite/ld-versados/versados.e
> > > > >xp ... Running
> > > > > /src/binutils-2.15.94.0.2/ld/testsuite/ld-x86-64/x86-64.exp
> > > > > ... Running
> > > > > /src/binutils-2.15.94.0.2/ld/testsuite/ld-xstormy16/xstormy16
> > > > >.exp ... Running
> > > > > /src/binutils-2.15.94.0.2/ld/testsuite/ld-xtensa/coalesce.exp
> > > > > ... Running
> > > > > /src/binutils-2.15.94.0.2/ld/testsuite/ld-xtensa/lcall.exp
> > > > > ...
> > > > >
> > > > >                 === ld Summary ===
> > > > >
> > > > > # of expected passes            196
> > > > > # of unexpected failures        40
> > > > > # of expected failures          4
> > > > > # of untested testcases         1
> > > > > /src/binutils-build/ld/ld-new 20041220
> > > > >
> > > > > make[3]: *** [check-DEJAGNU] Error 1
> > > > > make[3]: Leaving directory `/src/binutils-build/ld'
> > > > > make[2]: *** [check-am] Error 2
> > > > > make[2]: Leaving directory `/src/binutils-build/ld'
> > > > > make[1]: *** [check-recursive] Error 1
> > > > > make[1]: Leaving directory `/src/binutils-build/ld'
> > > > > make: *** [check-ld] Error 2
> > > > >
> > > > > __________________________________
> > > > > Osmium Work - Ingénierie Open Source
> > > > > http://www.osmium-work.com/
> > >
> > > --
> > > __________________________________
> > > Osmium Work - Ingénierie Open Source
> > > http://www.osmium-work.com/

-- 
__________________________________
Osmium Work - Ingénierie Open Source
Tél: +212 (0)22 821 105
Fax: +212 (0)22 820 721



More information about the hlfs-dev mailing list