[blfs-support] Fatal error in trying to build Kactivities-4.9.1

brown wrap gramos at yahoo.com
Thu Nov 22 10:24:28 PST 2012


I am nearing the end of building KDE. I was trying to build Kactivities-4.9.1 and encountered a fatal errors. Does anyone have a clue to what this problem is?


[ 91%] Building CXX object service/ui/plugins/declarativeui/CMakeFiles/activitymanager_uihandler_declarative.dir/kdeclarativeview.o
/usr/local/src/X11/tmp/kactivities-4.9.1/service/ui/plugins/declarativeui/kdeclarativeview.cpp:28:21: fatal error: QGLWidget: No such file or directory
compilation terminated.
make[2]: *** [service/ui/plugins/declarativeui/CMakeFiles/activitymanager_uihandler_declarative.dir/kdeclarativeview.o] Error 1
make[1]: *** [service/ui/plugins/declarativeui/CMakeFiles/activitymanager_uihandler_declarative.dir/all] Error 2
make: *** [all] Error 2
-------------- next part --------------
An HTML attachment was scrubbed...
URL: <http://lists.linuxfromscratch.org/pipermail/blfs-support/attachments/20121122/b55672a3/attachment.html>


More information about the blfs-support mailing list