[blfs-support] Errors trying to build seamonkey

brown wrap gramos at yahoo.com
Sun Nov 18 09:24:05 PST 2012



I have met the prerequisites for building seamonkey, and the build runs for quite a while, but ultimately fails. I searched here for errors in building seamonkey, but there isn't anything recent. Here is the error I get:

/usr/local/src/X11/KDE/comm-release/mozilla/gfx/thebes/gfxPlatform.cpp:670:10: warning: unused variable 'resultOfCopy' [-Wunused-variable]
make[6]: *** [gfxPlatform.o] Error 1
make[6]: Leaving directory `/usr/local/src/X11/KDE/comm-release/moz-build-dir/mozilla/gfx/thebes'
make[5]: *** [libs] Error 2
make[5]: Leaving directory `/usr/local/src/X11/KDE/comm-release/moz-build-dir/mozilla/gfx'
make[4]: *** [libs_tier_platform] Error 2
make[4]: Leaving directory `/usr/local/src/X11/KDE/comm-release/moz-build-dir/mozilla'
make[3]: *** [tier_platform] Error 2
make[3]: Leaving directory `/usr/local/src/X11/KDE/comm-release/moz-build-dir/mozilla'
make[2]: *** [default] Error 2
make[2]: Leaving directory `/usr/local/src/X11/KDE/comm-release/moz-build-dir/mozilla'
make[1]: *** [default] Error 2
make[1]: Leaving directory `/usr/local/src/X11/KDE/comm-release/moz-build-dir'
make: *** [build] Error 2
bash-4.2# 



More information about the blfs-support mailing list