[blfs-support] mutter-3.2.1 fails to build

Samantha Alice samantha-alice at virginmedia.com
Thu Feb 23 07:50:13 PST 2012


Hiya,

I'm trying to build Gnome 3.2.2 using blfs-version 2012-02-21.

Unfortunately mutter-3.2.1 fails to build with the following errors...

make[4]: Entering directory 
`/home/gordon/Software/g/gnome-3.2.2/mutter-3.2.1/src/compositor/plugins'
   CC     default_la-default.lo
In file included from 
/usr/include/clutter-1.0/clutter/clutter-backend.h:43:0,
                  from /usr/include/clutter-1.0/clutter/clutter.h:43,
                  from ../../../src/meta/compositor-mutter.h:28,
                  from ../../../src/meta/meta-plugin.h:29,
                  from default.c:24:
/usr/include/clutter-1.0/clutter/clutter-stage-window.h:77:3: error: 
unknown type name 'CoglFramebuffer'
/usr/include/clutter-1.0/clutter/clutter-stage-window.h:119:1: error: 
unknown type name 'CoglFramebuffer'
In file included from 
/usr/include/clutter-1.0/clutter/clutter-deform-effect.h:33:0,
                  from /usr/include/clutter-1.0/clutter/clutter.h:66,
                  from ../../../src/meta/compositor-mutter.h:28,
                  from ../../../src/meta/meta-plugin.h:29,
                  from default.c:24:
/usr/include/clutter-1.0/clutter/clutter-offscreen-effect.h:96:1: error: 
unknown type name 'CoglMaterial'
make[4]: *** [default_la-default.lo] Error 1
make[4]: Leaving directory 
`/home/gordon/Software/g/gnome-3.2.2/mutter-3.2.1/src/compositor/plugins'
make[3]: *** [all-recursive] Error 1
make[3]: Leaving directory 
`/home/gordon/Software/g/gnome-3.2.2/mutter-3.2.1/src'
make[2]: *** [all] Error 2
make[2]: Leaving directory 
`/home/gordon/Software/g/gnome-3.2.2/mutter-3.2.1/src'
make[1]: *** [all-recursive] Error 1
make[1]: Leaving directory 
`/home/gordon/Software/g/gnome-3.2.2/mutter-3.2.1'
make: *** [all] Error 2

Does anyone know how to resolve this?

Your help would be greatly appreciated.

Thanks in advance.

Samantha




More information about the blfs-support mailing list