Experiencing lots of build problems

William Immendorf will.immendorf at gmail.com
Fri Feb 26 05:57:29 PST 2010


On Thu, Feb 25, 2010 at 11:11 PM, brown wrap <gramos at yahoo.com> wrote:
> In file included from bits.c:39:
> /usr/include/string.h:546: error: expected declaration specifiers or ‘...’ before ‘__locale_t’
> /usr/include/string.h:547: error: nonnull argument with out-of-range operand number (argument 1, operand 3)
> /usr/include/string.h:550: error: expected declaration specifiers or ‘...’ before ‘__locale_t’
> /usr/include/string.h:551: error: nonnull argument with out-of-range operand number (argument 1, operand 4)
> make[3]: *** [bits.o] Error 1
> make[3]: Leaving directory `/home/final-sources-lfs-6.6/blfs/heimdal-1.1/include'
> make[2]: *** [all-recursive] Error 1
> make[2]: Leaving directory `/home/final-sources-lfs-6.6/blfs/heimdal-1.1/include'
> make[1]: *** [all] Error 2
> make[1]: Leaving directory `/home/final-sources-lfs-6.6/blfs/heimdal-1.1/include'
> make: *** [all-recursive] Error 1
Mmm, why don't you try Hemidal 1.3.2 instead of the old Hemidal-1.1
version? BTW: I don't use kerbros so the only help I can give you is
to try a new version. Hemidal 1.3.2 is avabiale here:

http://www.h5l.org/dist/src/heimdal-1.3.1.tar.gz


-- 
William Immendorf
The ultimate in free computing.
Messages in plain text, please, no HTML.

--------------

"Every nonfree program has a lord, a master --
and if you use the program, he is your master."  Richard Stallman



More information about the blfs-support mailing list