Experiencing lots of build problems

brown wrap gramos at yahoo.com
Thu Feb 25 21:11:28 PST 2010


In file included from bits.c:39:
/usr/include/string.h:546: error: expected declaration specifiers or ‘...’ before ‘__locale_t’
/usr/include/string.h:547: error: nonnull argument with out-of-range operand number (argument 1, operand 3)
/usr/include/string.h:550: error: expected declaration specifiers or ‘...’ before ‘__locale_t’
/usr/include/string.h:551: error: nonnull argument with out-of-range operand number (argument 1, operand 4)
make[3]: *** [bits.o] Error 1
make[3]: Leaving directory `/home/final-sources-lfs-6.6/blfs/heimdal-1.1/include'
make[2]: *** [all-recursive] Error 1
make[2]: Leaving directory `/home/final-sources-lfs-6.6/blfs/heimdal-1.1/include'
make[1]: *** [all] Error 2
make[1]: Leaving directory `/home/final-sources-lfs-6.6/blfs/heimdal-1.1/include'
make: *** [all-recursive] Error 1





I have ran into a number of problems trying to. The most current one involves the building of heimdal-1.1. I followed the directions, patched the download, ran configure, but it immediatley blows up.


      



More information about the blfs-support mailing list