hal build error

anirudh vij anirudhvij at gmail.com
Wed Apr 4 00:25:26 PDT 2007

i encountered the following build error in build of hal

make[3]: Entering directory `/home/hackman/hal-'
/bin/sh ../libtool --tag=CC --mode=link gcc  -g -O2 -Wall -Wchar-subscripts
-Wmissing-declarations -Wnested-externs -Wpointer-arith -Wcast-align
-Wsign-compare   -o lshal  lshal.o -L/usr//lib -ldbus-glib-1 -lgobject-2.0 -
lglib-2.0 -ldbus-1   ../libhal/libhal.la
gcc -g -O2 -Wall -Wchar-subscripts -Wmissing-declarations -Wnested-externs
-Wpointer-arith -Wcast-align -Wsign-compare -o .libs/lshal lshal.o
-L/usr//lib /usr//lib/libdbus-glib-1.so -lnsl
2.0.so ../libhal/.libs/libhal.so /usr//lib/libdbus-1.so -Wl,--rpath
lshal.o: In function `main':
/home/hackman/hal- undefined reference to
collect2: ld returned 1 exit status
make[3]: *** [lshal] Error 1
make[3]: Leaving directory `/home/hackman/hal-'
make[2]: *** [all-recursive] Error 1
make[2]: Leaving directory `/home/hackman/hal-'
make[1]: *** [all-recursive] Error 1
make[1]: Leaving directory `/home/hackman/hal-'
make: *** [all] Error 2

my dbus is version 1.0.0 installed as per the blfs book directions.the d-bus
daemon was not running at the time of this make error.i ran ldconfig after
dbus installation.dbus-glib is also installed and is version 1.0.0.hal is of
the book version.
-------------- next part --------------
An HTML attachment was scrubbed...
URL: <http://lists.linuxfromscratch.org/pipermail/blfs-support/attachments/20070404/71b9cbe0/attachment.html>

More information about the blfs-support mailing list