gcc-3.4.x make -k check errors

Lup thelupine at punkass.com
Tue Oct 26 11:37:41 PDT 2004


I've been trying for past few weeks now to get gcc-3.4.2 to compile on my
(B)LFS system.  I've built up a new LFS system from scratch, installed the
dependencies for gcc-3.4.2 but still can't get it to "make -k check".  Has
anyone been successful with this?  

I'm using a stock install of "Linux From Scratch Version 5.1.1" with
DejaGnu-1.4.4, Expect-5.42.1 and Tcl-8.4.7 from the BLFS book.  During the
make -k check I'm seeing stuff like:

      === libstdc++ Summary ===

# of unexpected failures        1415
# of expected failures          3
make[3]: *** [check-DEJAGNU] Error 1

      === libstdc++-v3 check-abi Summary ===

# of added symbols:              8
# of missing symbols:            7
# of incompatible symbols:       7

make[2]: Leaving directory `/tmp/gcc-build/i686-pc-linux-gnu/libstdc++-v3'
make[1]: *** [check-recursive] Error 1
make[1]: Target `check' not remade because of errors.
make[1]: Leaving directory `/tmp/gcc-build/i686-pc-linux-gnu/libstdc++-v3'
make: *** [check-target-libstdc++-v3] Error 2
make[1]: Entering directory `/tmp/gcc-build/i686-pc-linux-gnu/libiberty'
make[2]: Entering directory `/tmp/gcc-build/i686-pc-linux-gnu/libiberty/testsuite'
make[2]: Nothing to be done for `check'.
make[2]: Leaving directory `/tmp/gcc-build/i686-pc-linux-gnu/libiberty/testsuite'
make[1]: Leaving directory `/tmp/gcc-build/i686-pc-linux-gnu/libiberty'
make: Target `check' not remade because of errors.


Has anyone accomplished this, or is this just not gonna happen at this
time?  I've tried older versions of gcc-3.4.1 and even
gcc-3.4.0....nothing seems to be working.  Any suggestions?

Thanks, 
Lup




More information about the blfs-support mailing list