Beyond : Tinny or Huge mistake !

thunderben at free.fr thunderben at free.fr
Mon Jul 21 13:38:44 PDT 2003


Hi list, 

On advice from several of you, after my previous problem I tried to recompile 
my kernel...

A t the third step : make bzImage, I had systematically the error message 
listed at the bottom of this Email (in French).

So, to give you the english version of the message, I set LC_ALL to "", instead 
of "fr_FR".
I relaunch "make bzImage" to generate error message, AND THEN now compilation 
error, everythings goes right !!!!!!

My questions are : 
 - does all kernel Makefiles are designed to run under english, or US, 
environment ???
 - Does a non-US LFS guru have compiled his kernel with different locale 
environment ?


Thanks
-- 
Benoît



PS : the error message

some translations for the ones who don't understand Molière language ;o)
-Dans le fichier inclus à partir de = In file included from
-à partir de = from
-Aucun fichier ou répertoire de ce type = no such file or directory
-erreur d'analyse syntaxique avant = syntax analysis error before
-AVERTISSEMENT: déclaration de fonction n'est pas un prototype = WARNING: 
function declarationis not a prototype
- Erreur = error

"
Dans le fichier inclus à partir de /usr/src/linux-
2.4.19/include/linux/wait.h:13,
          à partir de /usr/src/linux-2.4.19/include/linux/fs.h:12,
          à partir de /usr/src/linux-2.4.19/include/linux/capability.h:17,
          à partir de /usr/src/linux-2.4.19/include/linux/binfmts.h:5,
          à partir de /usr/src/linux-2.4.19/include/linux/sched.h:9,
          à partir de /usr/src/linux-2.4.19/include/linux/mm.h:4,
          à partir de sched.c:23:
/usr/src/linux-2.4.19/include/linux/kernel.h:10:20: stdarg.h: Aucun fichier ou 
répertoire de ce type
Dans le fichier inclus à partir de /usr/src/linux-
2.4.19/include/linux/wait.h:13,
          à partir de /usr/src/linux-2.4.19/include/linux/fs.h:12,
          à partir de /usr/src/linux-2.4.19/include/linux/capability.h:17,
          à partir de /usr/src/linux-2.4.19/include/linux/binfmts.h:5,
          à partir de /usr/src/linux-2.4.19/include/linux/sched.h:9,
          à partir de /usr/src/linux-2.4.19/include/linux/mm.h:4,
          à partir de sched.c:23:
/usr/src/linux-2.4.19/include/linux/kernel.h:73: erreur d'analyse syntaxique 
avant « va_list »
/usr/src/linux-2.4.19/include/linux/kernel.h:73: AVERTISSEMENT: déclaration de 
fonction n'est pas un prototype
/usr/src/linux-2.4.19/include/linux/kernel.h:76: erreur d'analyse syntaxique 
avant « va_list »
/usr/src/linux-2.4.19/include/linux/kernel.h:76: AVERTISSEMENT: déclaration de 
fonction n'est pas un prototype
/usr/src/linux-2.4.19/include/linux/kernel.h:80: erreur d'analyse syntaxique 
avant « va_list »
/usr/src/linux-2.4.19/include/linux/kernel.h:80: AVERTISSEMENT: déclaration de 
fonction n'est pas un prototype
make[2]: *** [sched.o] Erreur 1
make[1]: *** [first_rule] Erreur 2
make: *** [_dir_kernel] Erreur 2
"
-- 
Unsubscribe: send email to listar at linuxfromscratch.org
and put 'unsubscribe blfs-support' in the subject header of the message



More information about the blfs-support mailing list