libgnomeprint-1.116.1 - "undefined reference to 'deflate'"

Mason Staugler mason at
Tue Nov 26 13:10:53 PST 2002

During make libgnomeprint returns the following error:

../libgnomeprint/.libs/ undefined reference to 'deflate'
../libgnomeprint/.libs/ undefined reference to 
../libgnomeprint/.libs/ undefined reference to 
collect2: ld returned 1 exit status
make[2]: *** [generate] Error 1
make[2]: Leaving directory 
make[1]: *** [all-recursive] Error 1
make[1]: Leaving directory '/usr/src/packages/gnome/libgnomeprint-1.116.1'
make: *** [all-recursive-am] Error 2

I did a Google search and found one relevent link where the person was 
told that skipping the "test" would help. I'm not sure how to do that, 


Unsubscribe: send email to listar at
and put 'unsubscribe blfs-support' in the subject header of the message

More information about the blfs-support mailing list