gnustep

Marco Rinck marco at romulus23.de
Fri Oct 12 14:17:22 PDT 2001


* Marco Rinck <marco at romulus23.de> [011012 22:49]:
> * Ainsley Pereira <marble at linuxfromscratch.org> [011012 22:29]:
> > In message <20011012222345.A271 at venus>
> >           Marco Rinck <marco at romulus23.de> wittered:
> > 
> > > So I downloaded and installed gnustep-make-1.01. As I wanted to
> > > compile gnustep-base-1.02 the configure script tells me that I don't
> > > have Objective C installed. Ok, I read the documentation of gnustep
> > > and downloaded gnustep-objc-1.0.0. But when I run the configure script
> > > it says me the following: 
> > 
> > I don't use Gnustep, or anything with objective c, so I'm not sure, but at
> > a guess, I'd say that gnustep-objc would be Objective C bindings for
> > Gnustep, rather than objective C itself. Have you compiled gcc with objc
> > in the --enable-languages= arg?
> 
> Hmm ... no! I didn't knew that I should and that I could. Ok, I'm
> compiling gcc now with objc maybe that helps. Thanks.

Ah! Now the configure script of gnustep-base runs perfectly. But when I run 
make I get
the following errors:

/usr/bin/ld: warning: type and size of dynamic symbol
`__objc_class_name_NSException' are not defined
/usr/bin/ld: warning: type and size of dynamic symbol
`__objc_class_name_NSNotificationCenter' are not defined
/usr/bin/ld: warning: type and size of dynamic symbol
`__objc_class_name_NSRunLoop' are not defined
/usr/bin/ld: warning: type and size of dynamic symbol
`__objc_class_name_NSUserDefaults' are not defined
/usr/bin/ld: warning: type and size of dynamic symbol
`__objc_class_name_NSMutableArray' are not defined
/usr/bin/ld: warning: type and size of dynamic symbol
`__objc_class_name_NSObject' are not defined
/usr/bin/ld: warning: type and size of dynamic symbol
`__objc_class_name_NSMutableDictionary' are not defined
/usr/bin/ld: warning: type and size of dynamic symbol
`__objc_class_name_NXConstantString' are not defined
/usr/bin/ld: warning: type and size of dynamic symbol
`__objc_class_name_NSAutoreleasePool' are not defined
/usr/bin/ld: warning: type and size of dynamic symbol
`__objc_class_name_NSConnection' are not defined
/usr/lib/gcc-lib/i686-pc-linux-gnu/2.95.3/libobjc.a(thr-posix.o): In
function `__objc_init_thread_system':
thr-posix.o(.text+0x11): undefined reference to `pthread_key_create'
/usr/lib/gcc-lib/i686-pc-linux-gnu/2.95.3/libobjc.a(thr-posix.o): In
function `__objc_mutex_trylock':
thr-posix.o(.text+0xd9): undefined reference to
`pthread_mutex_trylock'
/usr/lib/gcc-lib/i686-pc-linux-gnu/2.95.3/libobjc.a(thr-posix.o): In
function `__objc_thread_detach':
thr-posix.o(.text+0x1f1): undefined reference to `pthread_create'
/usr/lib/gcc-lib/i686-pc-linux-gnu/2.95.3/libobjc.a(thr-posix.o): In
function `__objc_thread_set_data':
thr-posix.o(.text+0x264): undefined reference to `pthread_setspecific'
/usr/lib/gcc-lib/i686-pc-linux-gnu/2.95.3/libobjc.a(thr-posix.o): In
function `__objc_thread_get_data':
thr-posix.o(.text+0x27c): undefined reference to `pthread_getspecific'
collect2: ld returned 1 exit status
make[3]: *** [shared_obj/ix86/linux-gnu/gnu-gnu-gnu/gdnc] Fehler 1
make[2]: *** [gdnc.build] Fehler 2
make[1]: *** [gdnc.all.tool.variables] Fehler 2
make: *** [internal-all] Fehler 2

The gnustep-objc package doesn't compile either. Same error message as
before. 

I don't know what to do ...

-- 
Ciao,
Marco

-= http://www.romulus23.de =-
-= http://www.medien-in-deutschland.de =-
-- 
Unsubscribe: send email to listar at linuxfromscratch.org
and put 'unsubscribe blfs-support' in the subject header of the message



More information about the blfs-support mailing list