[blfs-book] [BLFS Trac] #4077: tcl/tk-8.6.1

BLFS Trac trac at linuxfromscratch.org
Wed Sep 25 07:41:05 PDT 2013


#4077: tcl/tk-8.6.1
-------------------------+--------------------------
 Reporter:  bdubbs@…     |       Owner:  blfs-book@…
     Type:  enhancement  |      Status:  new
 Priority:  normal       |   Milestone:  current
Component:  BOOK         |     Version:  SVN
 Severity:  normal       |  Resolution:
 Keywords:               |
-------------------------+--------------------------

Comment (by fo):

 Both hanged, at the end of the tests and exit with errors which are
 apparently the same. That is whye I asked. Tail of the errors below and
 diff at the bottom.


 {{{
 ==== focusTcl-3.9 tk_focusPrev procedure, basic tree traversal FAILED
 ==== Contents of test case:

     setup1 .
     tk_focusPrev .a

 ---- Test generated error; Return code was: 1
 ---- Return code should have been one of: 0 2
 ---- errorInfo: can't invoke "destroy" command: application has been
 destroyed
     while executing
 "destroy $w.$i"
     (procedure "setup1" line 6)
     invoked from within
 "setup1 ."
     ("uplevel" body line 2)
     invoked from within
 "uplevel 1 $script"
 ---- errorCode: NONE
 ---- Test cleanup failed:
 can't invoke "destroy" command: application has been destroyed
 ---- errorInfo(cleanup): can't invoke "destroy" command: application has
 been destroyed
     while executing
 "destroy $w.$i"
     (procedure "cleanup1" line 6)
     invoked from within
 "cleanup1 ."
     ("uplevel" body line 2)
     invoked from within
 "uplevel 1 $cleanup"
 ---- errorCode(cleanup): NONE
 ==== focusTcl-3.9 FAILED

 Error in startup script: can't invoke "winfo" command: application has
 been destroyed
     while executing
 "winfo children ."
     (procedure "deleteWindows" line 2)
     invoked from within
 "deleteWindows"
     (file "/home/fernando/tmp/paco-
 build-2013.09.25-09h52m12s/tk8.6.1/tests/focusTcl.test" line 267)
     invoked from within
 "::source /home/fernando/tmp/paco-
 build-2013.09.25-09h52m12s/tk8.6.1/tests/focusTcl.test"
     ("uplevel" body line 1)
     invoked from within
 "uplevel 1 [list ::source $file]"
     (procedure "tcltest::runAllTests" line 3)
     invoked from within
 "tcltest::runAllTests"
     (file "/home/fernando/tmp/paco-
 build-2013.09.25-09h52m12s/tk8.6.1/unix/../tests/all.tcl" line 20)
 make: ** [test-classic] Erro 1

 }}}


 {{{
 $ diff -Nau Downloads/blfs/tk-8.6.0-2013.09.24-10h06m43s-failed-tests.log
 Downloads/blfs/tk-8.6.1-2013.09.25-09h52m12s-failed-tests.log
 --- Downloads/blfs/tk-8.6.0-2013.09.24-10h06m43s-failed-tests.log
 2013-09-25 11:27:32.983010051 -0300
 +++ Downloads/blfs/tk-8.6.1-2013.09.25-09h52m12s-failed-tests.log
 2013-09-25 11:25:44.985004276 -0300
 @@ -1,13 +1,7 @@
 -==== bitmap-4.1 FreeBitmapObjProc FAILED
 -==== bitmap-4.1 FAILED
 -==== border-3.1 FreeBorderObjProc FAILED
 -==== border-3.1 FAILED
  ==== button-5.24 ConfigureButton - computing geometry FAILED
  ==== button-5.24 FAILED
  ==== canvText-20.1 angled text bounding box FAILED
  ==== canvText-20.1 FAILED
 -==== cursor-4.1 FreeCursorObjProc FAILED
 -==== cursor-4.1 FAILED
  ==== entry-3.6 EntryWidgetCmd procedure, "bbox" widget command FAILED
  ==== entry-3.6 FAILED
  ==== entry-3.7 EntryWidgetCmd procedure, "bbox" widget command FAILED
 }}}

-- 
Ticket URL: <http://wiki.linuxfromscratch.org/blfs/ticket/4077#comment:3>
BLFS Trac <http://wiki.linuxfromscratch.org/blfs>
Beyond Linux From Scratch



More information about the blfs-book mailing list