[blfs-book] [BLFS Trac] #4312: PyGObject-3.10.2

BLFS Trac trac at linuxfromscratch.org
Tue Nov 12 06:45:14 PST 2013


#4312: PyGObject-3.10.2
-------------------------+-----------------------
 Reporter:  fo           |       Owner:  fo
     Type:  enhancement  |      Status:  assigned
 Priority:  normal       |   Milestone:  current
Component:  BOOK         |     Version:  SVN
 Severity:  normal       |  Resolution:
 Keywords:               |
-------------------------+-----------------------

Comment (by fo):

 Fails both for 2 and 3 modules: (here, 3 output). Add: Unknown reasons and
 ... -k check

 {{{
 ======================================================================
 FAIL: test_out_glist (test_atoms.TestGdkAtom)
 ----------------------------------------------------------------------
 Traceback (most recent call last):
   File "/home/fernando/tmp/paco-
 build-2013.11.12-10h29m35s/pygobject-3.10.2/tests/test_atoms.py", line 77,
 in test_out_glist
     self.assertTrue('Rel X' in axes_names)
 AssertionError: False is not true

 ----------------------------------------------------------------------
 Ran 897 tests in 10.518s

 FAILED (failures=1, expected failures=4)
 }}}

-- 
Ticket URL: <http://wiki.linuxfromscratch.org/blfs/ticket/4312#comment:2>
BLFS Trac <http://wiki.linuxfromscratch.org/blfs>
Beyond Linux From Scratch



More information about the blfs-book mailing list