[BLFS Trac] #2850: error when compile which-2.19

BLFS Trac trac at linuxfromscratch.org
Sat May 30 07:11:20 PDT 2009


#2850: error when compile which-2.19
---------------------+------------------------------------------------------
 Reporter:  caozhzh  |       Owner:  blfs-book@…                   
     Type:  task     |      Status:  new                           
 Priority:  normal   |   Milestone:  6.4                           
Component:  BOOK     |     Version:  SVN                           
 Severity:  normal   |    Keywords:                                
---------------------+------------------------------------------------------
 When I compile which-2.19
 I encouraged the error below:

 In file included from tilde.c:55:
 xmalloc.h:29:31: error: readline/rlstdc.h: No such file or directory
 make[2]: *** [tilde.o] Error 1
 make[1]: *** [all-recursive] Error 1
 make: *** [all] Error 2

 so, I used the second option to get which work.

-- 
Ticket URL: <http://wiki.linuxfromscratch.org/blfs/ticket/2850>
BLFS Trac <http://wiki.linuxfromscratch.org/blfs>
Beyond Linux From Scratch



More information about the blfs-book mailing list