[Bug 1574] New: gcc compiler error ~

blfs-bugs at linuxfromscratch.org blfs-bugs at linuxfromscratch.org
Wed Sep 7 06:40:12 PDT 2005


http://blfs-bugs.linuxfromscratch.org/show_bug.cgi?id=1574

           Summary: gcc compiler error ~
           Product: Beyond LinuxFromScratch
           Version: ~CVS
          Platform: PC
        OS/Version: Linux
            Status: NEW
          Severity: normal
          Priority: P2
         Component: BOOK
        AssignedTo: blfs-book at linuxfromscratch.org
        ReportedBy: kenmimic at gmail.com
         QAContact: blfs-book at linuxfromscratch.org


I use Gcc3.4.0 ,binutil 2.15, glibc 2.3.2 and the error occur in Gcc compiler 
process. and the error show down below.


E-mail bug reports to: bonzini at gnu.org .
Be sure to include the word ``sed'' somewhere in the ``Subject:'' field.
/bin/sh: rc: command not found
make[3]: *** [libgcc.a] Error 127
make[3]: Leaving directory `/mics/work/gnu/build-dir/build-boot-gcc-3.4.0-
1/gcc'
make[2]: *** [stmp-multilib] Error 2
make[2]: Leaving directory `/mics/work/gnu/build-dir/build-boot-gcc-3.4.0-
1/gcc'
make[1]: *** [stage1_build] Error 2
make[1]: Leaving directory `/mics/work/gnu/build-dir/build-boot-gcc-3.4.0-
1/gcc'
make: *** [bootstrap] Error 2



------- You are receiving this mail because: -------
You are the assignee for the bug, or are watching the assignee.
You are the QA contact for the bug, or are watching the QA contact.



More information about the blfs-book mailing list