nALFS Problem while making gcc

Thomas Volcan Thomas.Volcan at gmx.net
Wed May 19 08:35:29 PDT 2004


Hi all, 
 
I have a little problem while running nALFS. 
 
In the FAQ is a solution for a similar problem (ld cannot find -lc) but 
none for my problem. 
 
System SuSE Linux 9.0 
 
These are the final outputs... 
 
 
-: ar rc libcpp.a cpplib.o cpplex.o cppmacro.o cppexp.o cppfiles.o 
cpptrad.o cpphash.o cpperror.o cppinit.o cppd? 
?efault.o cppmain.o hashtable.o line-map.o mkdeps.o prefix.o mbchar.o       
                                    
? 
?-: ranlib libcpp.a                                                         
                                    
? 
?-: stage1/xgcc -Bstage1/ -B/tools/i686-pc-linux-gnu/bin/   -g -O2 -DIN_GCC 
 
-W -Wall -Wwrite-strings -Wstrict-p? 
?rototypes -Wmissing-prototypes -Wtraditional -pedantic -Wno-long-long   
-DHAVE_CONFIG_H -DGENERATOR_FILE -static? 
? -o genattrtab \                                                           
                                    
? 
?-:  genattrtab.o genautomata.o \                                           
                                    
? 
?-:  rtl.o read-rtl.o bitmap.o ggc-none.o gensupport.o insn-conditions.o 
print-rtl1.o errors.o \                 ? 
?-:  varray.o ../libiberty/libiberty.a -lm                                  
                                    
? 
?-: /tools/i686-pc-linux-gnu/bin/ld: cannot find -lm                        
                                    
? 
?-: collect2: ld returned 1 exit status                                     
                                    
? 
?-: make[2]: *** [genattrtab] Error 1                                       
                                    
? 
?-: make[2]: Leaving directory `/mnt/lfs/tools/build/gcc-build/gcc'         
                                    
? 
?-: make[1]: *** [stage2_build] Error 2                                     
                                    
? 
?-: make[1]: Leaving directory `/mnt/lfs/tools/build/gcc-build/gcc'         
                                    
? 
?-: make: *** [bootstrap] Error 2                                           
                                    
? 
?I: Log file stored in:                                                     
                                    
? 
?I: /var/log/ALFS/packages/gcc-pass1-3.3.1.xml                              
                                    
? 
?E: Execution failed (2).                                                   
                                    
? 
?I: Total time executing: 00:00:00 
 
 
I would be happy if anybody could help. 
 
THX 
 
Thomas 
 

-- 
"Sie haben neue Mails!" - Die GMX Toolbar informiert Sie beim Surfen!
Jetzt aktivieren unter http://www.gmx.net/info




More information about the alfs-discuss mailing list