cvs profile - cvs nalfs - vim error

jook jools at REMOVEfrogshit.com
Mon Mar 29 04:04:36 PST 2004


Hiho,
I ran nALFS-CVS with the profile-LFS-CVS overnight. I used the wget script 
to get all the packages.
First run it stopped at expect-5.40.0:

E: Expected digest : c79799a1c4ae2f51d8267110f6e37a8d
E: Found digest    : 6ae1b87c9af993a69b901b6e52962c18

I edited package.ent and restarted.

This time it stopped in chapter6 at vim-6.2:


I: Digest ok.
I: Unpacking /tools/packages-CVS-2004-02-27/vim-6.2.tar.bz2...
...
...
...
I: Done unpacking /tools/packages-CVS-2004-02-27/vim-6.2.tar.bz2.
I: Appending text to "src/feature.h".
I: Executing system command
I:      ./configure  --prefix=/usr 
...
...
...
I: Executing system command
I:      make  
-: Starting make in the src directory.
-: If there are problems, cd to the src directory and run make there
-: cd src && make first
-: make[1]: Entering directory `/tools/build/vim62/src'
-: mkdir objects
-: CC="gcc -Iproto -DHAVE_CONFIG_H     -g -O2       " srcdir=. sh 
./osdef.sh
-: gcc -c -I. -Iproto -DHAVE_CONFIG_H     -g -O2        -o objects/buffer.o 
buffer.c
-: In file included from vim.h:146,
-:                  from buffer.c:29:
-: feature.h:1180: error: parse error before '=' token
-: feature.h:1180: error: syntax error at '#' token
-: feature.h:1181: error: syntax error at '#' token
-: In file included from /usr/include/_G_config.h:44,
-:                  from /usr/include/libio.h:32,
-:                  from /usr/include/stdio.h:72,
-:                  from os_unix.h:21,
-:                  from vim.h:186,
-:                  from buffer.c:29:
-: /usr/include/gconv.h:72: error: parse error before "size_t"
-: /usr/include/gconv.h:88: error: parse error before "size_t"
-: /usr/include/gconv.h:97: error: parse error before "size_t"
-: /usr/include/gconv.h:174: error: parse error before "size_t"
...
...
lots more errors
...
...
-: buffer.c:4983: error: dereferencing pointer to incomplete type
-: buffer.c: At top level:
-: /usr/include/gconv.h:176: warning: array `__data' assumed to have one 
element
-: structs.h:993: error: storage size of `b_block_head' isn't known
-: buffer.c:2569: error: register name not specified for `__result'
-: buffer.c:2949: error: register name not specified for `__result'
-: buffer.c:4292: error: register name not specified for `__result'
-: buffer.c:4293: error: register name not specified for `__result'
-: buffer.c:4293: error: register name not specified for `__result'
-: buffer.c:4295: error: register name not specified for `__result'
-: buffer.c:4295: error: register name not specified for `__result'
-: buffer.c:4353: error: register name not specified for `__result'
-: buffer.c:4353: error: register name not specified for `__result'
-: buffer.c:4354: error: register name not specified for `__result'
-: buffer.c:4354: error: register name not specified for `__result'
-: make[1]: *** [objects/buffer.o] Error 1
-: make[1]: Leaving directory `/tools/build/vim62/src'
-: make: *** [first] Error 2
I: Log file stored in:
I: /var/log/ALFS/packages/vim-6.2.xml
E: Execution failed (2).




More information about the alfs-discuss mailing list