nALFS-1.2.4 make error

Joachim Beckers jbeckers at linuxfromscratch.org
Tue Aug 3 08:23:20 PDT 2004


Hi again,

I just tried again, did everything as root, just did "./configure" 
instead of "./configure --blablabla" and now "make" returns:

[root at localhost nALFS-1.2.4]# make
make  all-recursive
make[1]: Entering directory `/home/jbeckers/nALFS-1.2.4'
Making all in doc
make[2]: Entering directory `/home/jbeckers/nALFS-1.2.4/doc'
make[2]: Nothing to be done for `all'.
make[2]: Leaving directory `/home/jbeckers/nALFS-1.2.4/doc'
make[2]: Entering directory `/home/jbeckers/nALFS-1.2.4'
if /bin/sh ./libtool --silent --mode=compile gcc -DHAVE_CONFIG_H -I. -I. 
-I.    -I./src/include -I./src  -W -Wall -Wshadow -Winline  -g -O2 -MT 
src/lib/src_lib_libnALFS_la-digest.lo -MD -MP -MF 
"src/lib/.deps/src_lib_libnALFS_la-digest.Tpo" \
   -c -o src/lib/src_lib_libnALFS_la-digest.lo `test -f 
'src/lib/digest.c' || echo './'`src/lib/digest.c; \
then mv -f "src/lib/.deps/src_lib_libnALFS_la-digest.Tpo" 
"src/lib/.deps/src_lib_libnALFS_la-digest.Plo"; \
else rm -f "src/lib/.deps/src_lib_libnALFS_la-digest.Tpo"; exit 1; \
fi
In file included from src/lib/digest.c:48:
src/win.h:28:20: curses.h: No such file or directory
In file included from src/lib/digest.c:48:
src/win.h:79: error: syntax error before "WINDOW"
src/win.h:79: warning: no semicolon at end of struct or union
src/win.h:82: error: syntax error before '}' token
src/win.h:82: warning: type defaults to `int' in declaration of `window_s'
src/win.h:82: warning: data definition has no type or storage class
src/win.h:90: error: syntax error before "window_s"
src/win.h:90: warning: no semicolon at end of struct or union
src/win.h:91: warning: type defaults to `int' in declaration of `status'
src/win.h:91: warning: data definition has no type or storage class
src/win.h:99: error: syntax error before '}' token
src/win.h:99: warning: type defaults to `int' in declaration of `windows_s'
src/win.h:99: warning: data definition has no type or storage class
src/win.h:101: error: syntax error before "windows"
src/win.h:101: warning: type defaults to `int' in declaration of `windows'
src/win.h:101: warning: data definition has no type or storage class
src/win.h:107: warning: declaration of `lines' shadows a global declaration
src/win.h:80: warning: shadowed declaration is here
src/lib/digest.c: In function `verify_digest':
src/lib/digest.c:78: error: `FILE' undeclared (first use in this function)
src/lib/digest.c:78: error: (Each undeclared identifier is reported only 
once
src/lib/digest.c:78: error: for each function it appears in.)
src/lib/digest.c:78: error: `istream' undeclared (first use in this 
function)
src/lib/digest.c:112: warning: implicit declaration of function `fopen'
src/lib/digest.c:116: warning: implicit declaration of function `fread'
src/lib/digest.c:134: warning: implicit declaration of function `fclose'
src/lib/digest.c:137: warning: implicit declaration of function `sprintf'
make[2]: *** [src/lib/src_lib_libnALFS_la-digest.lo] Error 1
make[2]: Leaving directory `/home/jbeckers/nALFS-1.2.4'
make[1]: *** [all-recursive] Error 1
make[1]: Leaving directory `/home/jbeckers/nALFS-1.2.4'
make: *** [all] Error 2
[root at localhost nALFS-1.2.4]#



-- 
Joachim Beckers
Reg. Linux user -- #328931 -- http://counter.li.org/
Reg. LFS user   -- #11587  -- http://www.linuxfromscratch.org/
Official BLFS-profile editor



More information about the alfs-discuss mailing list